BDBM50325684 (S)-2-((4R,5R)-5-(biphenyl-2-ylcarbamoyl)-1,3-dioxolane-4-carboxamido)-3-(4-(2,6-dichlorobenzamido)phenyl)propanoic acid::CHEMBL1223921
SMILES OC(=O)[C@H](Cc1ccc(NC(=O)c2c(Cl)cccc2Cl)cc1)NC(=O)[C@@H]1OCO[C@H]1C(=O)Nc1ccccc1-c1ccccc1
InChI Key InChIKey=GKVFPAULNAWNJX-WIIGKZCBSA-N
Data  1 IC50
  Tab Delimited (TSV)   2D SDfile   Computed 3D by Vconf -m prep SDfile
Find this compound or compounds like it in BindingDB:
Activity Spreadsheet -- Enzyme Inhibition Constant Data from BindingDB
Found 1 hit for monomerid = 50325684
TargetIntegrin alpha-4(Homo sapiens (Human))
New Drug Discovery Research
Curated by ChEMBL
LigandPNGBDBM50325684((S)-2-((4R,5R)-5-(biphenyl-2-ylcarbamoyl)-1,3-diox...)
Affinity DataIC50:  100nM. Assay description: Displacement of VCAM1 from VLA4 receptor in human U937 cells
In DepthDetails ArticlePubMed