BDBM50325801 4-(2'-(trifluoromethyl)biphenyl-3-yl)oxazole::CHEMBL1224519
SMILES FC(F)(F)c1ccccc1-c1cccc(c1)-c1cocn1
InChI Key InChIKey=SRZDIBWHWBVAAW-UHFFFAOYSA-N
Data  1 IC50
  Tab Delimited (TSV)   2D SDfile   Computed 3D by Vconf -m prep SDfile
Find this compound or compounds like it in BindingDB:
Activity Spreadsheet -- Enzyme Inhibition Constant Data from BindingDB
Found 1 hit for monomerid = 50325801
TargetSodium channel protein type 9 subunit alpha(Homo sapiens (Human))
Merck Research Laboratories
Curated by ChEMBL
LigandPNGBDBM50325801(4-(2'-(trifluoromethyl)biphenyl-3-yl)oxazole | CHE...)
Affinity DataIC50:  5.31E+3nM. Assay description: Blockade of human Nav1.7 by voltage ion probe reader based FRET assay
In DepthDetails ArticlePubMed