BDBM50326052 (E)-2-benzylidene-3-(cyclohexylamino)-2,3-dihydro-1H-inden-1-one::CHEMBL1241589
SMILES O=C1\C(=C\c2ccccc2)C(NC2CCCCC2)c2ccccc12
InChI Key InChIKey=XJDKPLZUXCIMIS-HMMYKYKNSA-N
Data  2 IC50
  Tab Delimited (TSV)   2D SDfile   Computed 3D by Vconf -m prep SDfile
Find this compound or compounds like it in BindingDB:
Activity Spreadsheet -- Enzyme Inhibition Constant Data from BindingDB
Found 2 hits for monomerid = 50326052
TargetDual specificity protein phosphatase 6(Homo sapiens (Human))
University Of Pittsburgh
Curated by ChEMBL
LigandPNGBDBM50326052((E)-2-benzylidene-3-(cyclohexylamino)-2,3-dihydro-...)
Affinity DataIC50:  1.23E+4nM. Assay description: Inhibition of Myc-tagged human Dusp6 expressed in TPA-induced human HeLa cells asssessed as decrease in dephosphorylation of pERK measured by immunos...
In DepthDetails ArticlePubMed
TargetDual specificity protein phosphatase 1(Homo sapiens (Human))
University Of Pittsburgh
Curated by ChEMBL
LigandPNGBDBM50326052((E)-2-benzylidene-3-(cyclohexylamino)-2,3-dihydro-...)
Affinity DataIC50:  1.15E+4nM. Assay description: Inhibition of Myc-tagged human Dusp1 expressed in TPA-induced human HeLa cells asssessed as decrease in dephosphorylation of pERK measured by immunos...
In DepthDetails ArticlePubMed