BDBM50326101 (S)-3-(((9H-fluoren-9-yl)methoxy)carbonylamino)-5-(methylsulfonyl)pent-4-enoic acid::CHEMBL1242422
SMILES CS(=O)(=O)C=C[C@H](CC(O)=O)NC(=O)OCC1c2ccccc2-c2ccccc12
InChI Key InChIKey=AIDZDWDPPSGMCR-CQSZACIVSA-N
Data  3 IC50
  Tab Delimited (TSV)   2D SDfile   Computed 3D by Vconf -m prep SDfile
Find this compound or compounds like it in BindingDB:
Activity Spreadsheet -- Enzyme Inhibition Constant Data from BindingDB
Found 3 hits for monomerid = 50326101
TargetCaspase-3(Homo sapiens (Human))
University Of Lisbon
Curated by ChEMBL
LigandPNGBDBM50326101((S)-3-(((9H-fluoren-9-yl)methoxy)carbonylamino)-5-...)
Affinity DataIC50:  1.63E+5nM. Assay description: Inhibition of human recombinant caspase 3 assessed as fluorescent 7-amido-4-methylcoumarin release
In DepthDetails ArticlePubMed
TargetCaspase-3(Homo sapiens (Human))
University Of Lisbon
Curated by ChEMBL
LigandPNGBDBM50326101((S)-3-(((9H-fluoren-9-yl)methoxy)carbonylamino)-5-...)
Affinity DataIC50:  2.37E+4nM. Assay description: Inhibition of human recombinant caspase-3 expressed in Saccharomyces cerevisiae CG379 assessed as growth stimulation after 2 days
In DepthDetails ArticlePubMed
TargetCaspase-7(Homo sapiens (Human))
University Of Lisbon
Curated by ChEMBL
LigandPNGBDBM50326101((S)-3-(((9H-fluoren-9-yl)methoxy)carbonylamino)-5-...)
Affinity DataIC50: >2.00E+5nM. Assay description: Inhibition of human recombinant caspase 7 assessed as fluorescent 7-amido-4-methylcoumarin release
In DepthDetails ArticlePubMed