BDBM50326205 CHEMBL1243167::N-(2-Methyl-4-(3-(2-(methylamino)pyrimidin-4-yl)pyridin-2-yloxy)phenyl)-2-(phenylamino)benzamide
SMILES CNc1nccc(n1)-c1cccnc1Oc1ccc(NC(=O)c2ccccc2Nc2ccccc2)c(C)c1
InChI Key InChIKey=VHJIZZORCPKCDP-UHFFFAOYSA-N
Data  1 IC50  1 EC50
  Tab Delimited (TSV)   2D SDfile   Computed 3D by Vconf -m prep SDfile
Find this compound or compounds like it in BindingDB:
Activity Spreadsheet -- Enzyme Inhibition Constant Data from BindingDB
Found 2 hits for monomerid = 50326205
TargetAurora kinase B(Homo sapiens (Human))
Amgen
Curated by ChEMBL
LigandPNGBDBM50326205(CHEMBL1243167 | N-(2-Methyl-4-(3-(2-(methylamino)p...)
Affinity DataEC50:  1.45E+3nM. Assay description: Inhibition of aurora B in human HeLa cells assessed as increase of >= 4N DNA level after 24 hrs by Hoechst staining
In DepthDetails ArticlePubMed
TargetAurora kinase B(Homo sapiens (Human))
Amgen
Curated by ChEMBL
LigandPNGBDBM50326205(CHEMBL1243167 | N-(2-Methyl-4-(3-(2-(methylamino)p...)
Affinity DataIC50:  110nM. Assay description: Inhibition of Aurora B by HTRF assay
In DepthDetails ArticlePubMed