BDBM50326313 (Z)-1-(4-(Methylsulfonyl)phenyl)-2-phenyl-3-p-tolylprop-2-en-1-one::CHEMBL1243146
SMILES Cc1ccc(\C=C(/C(=O)c2ccc(cc2)S(C)(=O)=O)c2ccccc2)cc1
InChI Key InChIKey=JIUDLNXREYFIAA-JWGURIENSA-N
Data  2 IC50
  Tab Delimited (TSV)   2D SDfile   Computed 3D by Vconf -m prep SDfile
Find this compound or compounds like it in BindingDB:
Activity Spreadsheet -- Enzyme Inhibition Constant Data from BindingDB
Found 2 hits for monomerid = 50326313
TargetProstaglandin G/H synthase 2(Ovis aries (Sheep))
Shahid Beheshti University Of Medical Sciences
Curated by ChEMBL
LigandPNGBDBM50326313((Z)-1-(4-(Methylsulfonyl)phenyl)-2-phenyl-3-p-toly...)
Affinity DataIC50:  210nM. Assay description: Inhibition of ovine COX2 by chemiluminescence assay
In DepthDetails ArticlePubMed
TargetProstaglandin G/H synthase 1(Ovis aries (Sheep))
Shahid Beheshti University Of Medical Sciences
Curated by ChEMBL
LigandPNGBDBM50326313((Z)-1-(4-(Methylsulfonyl)phenyl)-2-phenyl-3-p-toly...)
Affinity DataIC50:  1.22E+4nM. Assay description: Inhibition of ovine COX1 by chemiluminescence assay
In DepthDetails ArticlePubMed