BDBM50326340 (R)-4-(4-fluoro phenyl)-2-(2-(3-methylcyclohexylidene)hydrazinyl)thiazole::CHEMBL1243245
SMILES C[C@@H]1CCCC(C1)=NNc1nc(cs1)-c1ccc(F)cc1
InChI Key InChIKey=NWQWTMZVVHKXDY-LLVKDONJSA-N
Data  2 IC50
  Tab Delimited (TSV)   2D SDfile   Computed 3D by Vconf -m prep SDfile
Find this compound or compounds like it in BindingDB:
Activity Spreadsheet -- Enzyme Inhibition Constant Data from BindingDB
Found 2 hits for monomerid = 50326340
TargetAmine oxidase [flavin-containing] B(Homo sapiens (Human))
Sapienza University Of Rome
Curated by ChEMBL
LigandPNGBDBM50326340((R)-4-(4-fluoro phenyl)-2-(2-(3-methylcyclohexylid...)
Affinity DataIC50:  810nM. Assay description: Inhibition of human recombinant MAOB expressed in baculovirus infected insect BTI-TN-5B1-4 cells assessed as production of hydrogen peroxide from p-t...
In DepthDetails ArticlePubMed
TargetAmine oxidase [flavin-containing] A(Homo sapiens (Human))
Sapienza University Of Rome
Curated by ChEMBL
LigandPNGBDBM50326340((R)-4-(4-fluoro phenyl)-2-(2-(3-methylcyclohexylid...)
Affinity DataIC50:  4.03E+4nM. Assay description: Inhibition of human recombinant MAOA expressed in baculovirus infected insect BTI-TN-5B1-4 cells assessed as production of hydrogen peroxide from p-t...
In DepthDetails ArticlePubMed