BDBM50272867 (S)-1-(2-methylcyclohexylidene)-2-(4-(4-nitrophenyl)thiazol-2-yl)hydrazine::CHEMBL1243371::CHEMBL498694
SMILES C[C@H]1CCCCC1=NNc1nc(cs1)-c1ccc(cc1)[N+]([O-])=O
InChI Key InChIKey=PSORHSVNOKESRG-NSHDSACASA-N
Data  6 IC50
  Tab Delimited (TSV)   2D SDfile   Computed 3D by Vconf -m prep SDfile
Find this compound or compounds like it in BindingDB:
Activity Spreadsheet -- Enzyme Inhibition Constant Data from BindingDB
Found 6 hits for monomerid = 50272867
TargetAmine oxidase [flavin-containing] A(Homo sapiens (Human))
Sapienza University Of Rome
Curated by ChEMBL
LigandPNGBDBM50272867((S)-1-(2-methylcyclohexylidene)-2-(4-(4-nitropheny...)
Affinity DataIC50:  4.23E+4nM. Assay description: Inhibition of human recombinant MAOA
In DepthDetails ArticlePubMed
TargetAmine oxidase [flavin-containing] B(Homo sapiens (Human))
Sapienza University Of Rome
Curated by ChEMBL
LigandPNGBDBM50272867((S)-1-(2-methylcyclohexylidene)-2-(4-(4-nitropheny...)
Affinity DataIC50:  16.6nM. Assay description: Inhibition of human recombinant MAOB
In DepthDetails ArticlePubMed
TargetAmine oxidase [flavin-containing] A(Homo sapiens (Human))
Sapienza University Of Rome
Curated by ChEMBL
LigandPNGBDBM50272867((S)-1-(2-methylcyclohexylidene)-2-(4-(4-nitropheny...)
Affinity DataIC50:  4.23E+4nM. Assay description: Inhibition of human recombinant MAOA expressed in baculovirus infected BTI-TN-5B1-4 insect cells assessed as hydrogen peroxide production from p-tyra...
In DepthDetails ArticlePubMed
TargetAmine oxidase [flavin-containing] B(Homo sapiens (Human))
Sapienza University Of Rome
Curated by ChEMBL
LigandPNGBDBM50272867((S)-1-(2-methylcyclohexylidene)-2-(4-(4-nitropheny...)
Affinity DataIC50:  16nM. Assay description: Inhibition of human recombinant MAOB expressed in baculovirus infected insect BTI-TN-5B1-4 cells assessed as production of hydrogen peroxide from p-t...
In DepthDetails ArticlePubMed
TargetAmine oxidase [flavin-containing] B(Homo sapiens (Human))
Sapienza University Of Rome
Curated by ChEMBL
LigandPNGBDBM50272867((S)-1-(2-methylcyclohexylidene)-2-(4-(4-nitropheny...)
Affinity DataIC50:  17nM. Assay description: Inhibition of human recombinant MAOB expressed in baculovirus infected BTI-TN-5B1-4 insect cells assessed as hydrogen peroxide production from p-tyra...
In DepthDetails ArticlePubMed
TargetAmine oxidase [flavin-containing] A(Homo sapiens (Human))
Sapienza University Of Rome
Curated by ChEMBL
LigandPNGBDBM50272867((S)-1-(2-methylcyclohexylidene)-2-(4-(4-nitropheny...)
Affinity DataIC50:  4.23E+4nM. Assay description: Inhibition of human recombinant MAOA expressed in baculovirus infected insect BTI-TN-5B1-4 cells assessed as production of hydrogen peroxide from p-t...
In DepthDetails ArticlePubMed