BDBM50326477 3',4',5'-Trimethoxybiphenyl-3-ol::CHEMBL1241350
SMILES COc1cc(cc(OC)c1OC)-c1cccc(O)c1
InChI Key InChIKey=XXKFMWSAWSTEFD-UHFFFAOYSA-N
Data  1 IC50
  Tab Delimited (TSV)   2D SDfile   Computed 3D by Vconf -m prep SDfile
Find this compound or compounds like it in BindingDB:
Activity Spreadsheet -- Enzyme Inhibition Constant Data from BindingDB
Found 1 hit for monomerid = 50326477
TargetPolyphenol oxidase 2(Agaricus bisporus (Common mushroom))
Jinan University
Curated by ChEMBL
LigandPNGBDBM50326477(3',4',5'-Trimethoxybiphenyl-3-ol | CHEMBL1241350)
Affinity DataIC50: >2.00E+6nM. Assay description: Inhibition of mushroom tyrosinase after 30 mins
In DepthDetails ArticlePubMed