BDBM50326553 2-(3-((R)-2-((R)-2-hydroxy-2-(4-hydroxy-3-(methylsulfonamido)phenyl)ethylamino)propyl)phenyl)-N-(3-phenylpropyl)acetamide::CHEMBL1243222
SMILES C[C@H](Cc1cccc(CC(=O)NCCCc2ccccc2)c1)NC[C@H](O)c1ccc(O)c(NS(C)(=O)=O)c1
InChI Key InChIKey=WNUBTKNYYAYBAW-PIKZIKFNSA-N
Data  1 EC50
  Tab Delimited (TSV)   2D SDfile   Computed 3D by Vconf -m prep SDfile
Find this compound or compounds like it in BindingDB:
Activity Spreadsheet -- Enzyme Inhibition Constant Data from BindingDB
Found 1 hit for monomerid = 50326553
TargetBeta-2 adrenergic receptor(Homo sapiens (Human))
Pfizer
Curated by ChEMBL
LigandPNGBDBM50326553(2-(3-((R)-2-((R)-2-hydroxy-2-(4-hydroxy-3-(methyls...)
Affinity DataEC50:  0.0400nM. Assay description: Agonist activity at human recombinant beta2 adrenergic receptor expressed in CHO cells assessed as elevation in cAMP level after 1 hr by flashplate m...
In DepthDetails ArticlePubMed