BDBM50326576 3-(2,4-difluorophenylamino)-1-(5-methylfuran-2-yl)prop-2-en-1-one::CHEMBL1253546
SMILES Cc1ccc(o1)C(=O)CC=Nc1ccc(F)cc1F
InChI Key InChIKey=NEJWEPMZKFQTTL-UHFFFAOYSA-N
Data  1 IC50
  Tab Delimited (TSV)   2D SDfile   Computed 3D by Vconf -m prep SDfile
Find this compound or compounds like it in BindingDB:
Activity Spreadsheet -- Enzyme Inhibition Constant Data from BindingDB
Found 1 hit for monomerid = 50326576
TargetMacrophage migration inhibitory factor(Homo sapiens (Human))
Brain Mind Institute
Curated by ChEMBL
LigandPNGBDBM50326576(3-(2,4-difluorophenylamino)-1-(5-methylfuran-2-yl)...)
Affinity DataIC50:  5.75E+4nM. Assay description: Inhibition of human MIF tautomerase activity
In DepthDetails ArticlePubMed