BDBM50287632 CHEMBL1253325::PKYVKQNTLKLAT (HA306-318 peptide)
SMILES CC(C)C[C@H](NC(=O)[C@H](CCCCN)NC(=O)[C@H](CC(C)C)NC(=O)[C@@H](NC(=O)[C@H](CC(N)=O)NC(=O)[C@H](CCC(N)=O)NC(=O)[C@H](CCCCN)NC(=O)[C@@H](NC(=O)[C@H](Cc1ccc(O)cc1)NC(=O)[C@H](CCCCN)NC(=O)[C@@H]1CCCN1)C(C)C)[C@@H](C)O)C(=O)N[C@@H](C)C(=O)N[C@@H]([C@@H](C)O)C(O)=O
InChI Key InChIKey=TVBVLFBAWBXUER-CMGQGHTMSA-N
Data  2 IC50
  Tab Delimited (TSV)   2D SDfile   Computed 3D by Vconf -m prep SDfile
Find this compound or compounds like it in BindingDB:
Activity Spreadsheet -- Enzyme Inhibition Constant Data from BindingDB
Found 2 hits for monomerid = 50287632
TargetTumor necrosis factor receptor superfamily member 10A(Homo sapiens (Human))
TBA
Curated by ChEMBL
LigandPNGBDBM50287632(CHEMBL1253325 | PKYVKQNTLKLAT (HA306-318 peptide))
Affinity DataIC50:  80nM. Assay description: Compound was tested for its ability to compete for binding to DR4 using ELISA assay.
In DepthDetails Article
TargetMHC class II antigen(Homo sapiens (Human))
University Of Massachusetts Medical School
Curated by ChEMBL
LigandPNGBDBM50287632(CHEMBL1253325 | PKYVKQNTLKLAT (HA306-318 peptide))
Affinity DataIC50:  4nM. Assay description: Displacement of biotin-HA from recombinant soluble HLA-DR1 expressed in human T2 cells by ELISA
In DepthDetails ArticlePubMed