BDBM50326998 CHEMBL591036::Pelargonidin
SMILES Oc1ccc(cc1)-c1oc2cc(O)cc(=[OH+])c2cc1O
InChI Key InChIKey=XVMZAHRLHKPMNY-UHFFFAOYSA-O
Data  2 IC50
  Tab Delimited (TSV)   2D SDfile   Computed 3D by Vconf -m prep SDfile
Find this compound or compounds like it in BindingDB:
Activity Spreadsheet -- Enzyme Inhibition Constant Data from BindingDB
Found 2 hits for monomerid = 50326998
TargetADP-ribosyl cyclase/cyclic ADP-ribose hydrolase 1(Homo sapiens (Human))
University Of Strasburg
Curated by ChEMBL
LigandPNGBDBM50326998(CHEMBL591036 | Pelargonidin)
Affinity DataIC50:  1.63E+4nM. Assay description: Inhibition of human CD38 using 20 uM 1, N6-etheno NAD+ as substrate by continuous fluorimetric method
In DepthDetails ArticlePubMed
TargetLactoylglutathione lyase(Homo sapiens (Human))
Tokyo University Of Science
Curated by ChEMBL
LigandPNGBDBM50326998(CHEMBL591036 | Pelargonidin)
Affinity DataIC50:  1.64E+4nM. Assay description: Inhibition of human recombinant glyoxalase 1 assessed as S-D-lactoylglutathione after 15 mins by spectrophotometric analysis
In DepthDetails ArticlePubMed