BDBM50327184 5-[3-tert-Butyl-5-(3-naphthalen-1-yl-ureido)-pyrazol-1-yl]-N-((3S,4S)-4-hydroxy-1,1-dioxo-tetrahydro-1lambda6-thiophen-3-yl)-2-methyl-benzamide::CHEMBL1257569
SMILES Cc1ccc(cc1C(=O)N[C@@H]1CS(=O)(=O)C[C@H]1O)-n1nc(cc1NC(=O)Nc1cccc2ccccc12)C(C)(C)C
InChI Key InChIKey=VJPCTCPHUIBJIV-JWQCQUIFSA-N
Data  1 KI
  Tab Delimited (TSV)   2D SDfile   Computed 3D by Vconf -m prep SDfile
Find this compound or compounds like it in BindingDB:
Activity Spreadsheet -- Enzyme Inhibition Constant Data from BindingDB
Found 1 hit for monomerid = 50327184
TargetMitogen-activated protein kinase 14(Homo sapiens (Human))
Abbott Laboratories
Curated by ChEMBL
LigandPNGBDBM50327184(5-[3-tert-Butyl-5-(3-naphthalen-1-yl-ureido)-pyraz...)
Affinity DataKi:  112nM. Assay description: Binding affinity to full-length GST-tagged p38alpha after 2.5 hrs by TR-FRET competition binding assay
In DepthDetails ArticlePubMed