BDBM50327185 CHEMBL1256034::N-(3-aminopropyl)-5-(3-tert-butyl-5-(3-naphthalen-1-ylureido)-1H-pyrazol-1-yl)-N-cyclohexyl-2-methylbenzamide
SMILES Cc1ccc(cc1C(=O)N(CCCN)C1CCCCC1)-n1nc(cc1NC(=O)Nc1cccc2ccccc12)C(C)(C)C
InChI Key InChIKey=KZNDGYUJQVSRNW-UHFFFAOYSA-N
Data  1 KI
  Tab Delimited (TSV)   2D SDfile   Computed 3D by Vconf -m prep SDfile
Find this compound or compounds like it in BindingDB:
Activity Spreadsheet -- Enzyme Inhibition Constant Data from BindingDB
Found 1 hit for monomerid = 50327185
TargetMitogen-activated protein kinase 14(Homo sapiens (Human))
Abbott Laboratories
Curated by ChEMBL
LigandPNGBDBM50327185(CHEMBL1256034 | N-(3-aminopropyl)-5-(3-tert-butyl-...)
Affinity DataKi:  89nM. Assay description: Binding affinity to full-length GST-tagged p38alpha after 2.5 hrs by TR-FRET competition binding assay
In DepthDetails ArticlePubMed