BDBM50327225 5-phenyl-2-(4-(piperidin-1-yl)butyl)oxazole::CHEMBL1257573
SMILES C(CCc1ncc(o1)-c1ccccc1)CN1CCCCC1
InChI Key InChIKey=XJINDZCEGQZNLD-UHFFFAOYSA-N
Data  1 KI
  Tab Delimited (TSV)   2D SDfile   Computed 3D by Vconf -m prep SDfile
Find this compound or compounds like it in BindingDB:
Activity Spreadsheet -- Enzyme Inhibition Constant Data from BindingDB
Found 1 hit for monomerid = 50327225
TargetHistamine H3 receptor(Homo sapiens (Human))
Johann Wolfgang Goethe University
Curated by ChEMBL
LigandPNGBDBM50327225(5-phenyl-2-(4-(piperidin-1-yl)butyl)oxazole | CHEM...)
Affinity DataKi:  63nM. Assay description: Displacement of [125I]Iodoproxyfan from human histamine H3 receptor expressed in HEK293 cells
In DepthDetails ArticlePubMed