BDBM50327380 (1S,2R,5aR,7R,8aS,8bS)-7-amino-2-((R)-1-(3,5-bis(trifluoromethyl)phenyl)ethoxy)-1-(4-fluorophenyl)octahydrocyclopenta[a]pyrrolizin-5(5aH)-one::CHEMBL1258732
SMILES C[C@@H](O[C@H]1CN2[C@@H]([C@H]3C[C@@H](N)C[C@H]3C2=O)[C@@H]1c1ccc(F)cc1)c1cc(cc(c1)C(F)(F)F)C(F)(F)F
InChI Key InChIKey=CMHQSZGZHCBTQY-HNDHONNRSA-N
Data  2 IC50
  Tab Delimited (TSV)   2D SDfile   Computed 3D by Vconf -m prep SDfile
Find this compound or compounds like it in BindingDB:
Activity Spreadsheet -- Enzyme Inhibition Constant Data from BindingDB
Found 2 hits for monomerid = 50327380
TargetSubstance-P receptor(Homo sapiens (Human))
Merck Research Laboratories
Curated by ChEMBL
LigandPNGBDBM50327380((1S,2R,5aR,7R,8aS,8bS)-7-amino-2-((R)-1-(3,5-bis(t...)
Affinity DataIC50:  1.5nM. Assay description: Displacement of [125I]substance P from human NK1 receptor expressed in CHO cells
In DepthDetails ArticlePubMed
TargetSubstance-P receptor(Homo sapiens (Human))
Merck Research Laboratories
Curated by ChEMBL
LigandPNGBDBM50327380((1S,2R,5aR,7R,8aS,8bS)-7-amino-2-((R)-1-(3,5-bis(t...)
Affinity DataIC50:  47nM. Assay description: Displacement of [125I]substance P from human NK1 receptor expressed in CHO cells in presence of 50% human serum
In DepthDetails ArticlePubMed