BDBM50327413 5-(6-(2-chlorophenyl)-2-(dimethylamino)pyrimidin-4-yl)-N-isopropylthiazol-2-amine::CHEMBL1258863
SMILES CC(C)Nc1ncc(s1)-c1cc(nc(n1)N(C)C)-c1ccccc1Cl
InChI Key InChIKey=ICEIOGQLXCVBJH-UHFFFAOYSA-N
Data  1 IC50
  Tab Delimited (TSV)   2D SDfile   Computed 3D by Vconf -m prep SDfile
Find this compound or compounds like it in BindingDB:
Activity Spreadsheet -- Enzyme Inhibition Constant Data from BindingDB
Found 1 hit for monomerid = 50327413
TargetMitogen-activated protein kinase 14(Homo sapiens (Human))
Bristol-Myers Squibb Pharmaceutical Research Institute
Curated by ChEMBL
LigandPNGBDBM50327413(5-(6-(2-chlorophenyl)-2-(dimethylamino)pyrimidin-4...)
Affinity DataIC50:  573nM. Assay description: Inhibition of bacterially expressed activated p38alpha pre-incubated 10 mins measured after 45 mins by scintillation counting
In DepthDetails ArticlePubMed