BDBM50327701 2-(1-octyl-5-phenyl-1H-indol-3-yl)acetamide::CHEMBL1257868
SMILES CCCCCCCCn1cc(CC(N)=O)c2cc(ccc12)-c1ccccc1
InChI Key InChIKey=ZCFSXENMRFRDAC-UHFFFAOYSA-N
Data  1 IC50
  Tab Delimited (TSV)   2D SDfile   Computed 3D by Vconf -m prep SDfile
Find this compound or compounds like it in BindingDB:
Activity Spreadsheet -- Enzyme Inhibition Constant Data from BindingDB
Found 1 hit for monomerid = 50327701
TargetProtein-S-isoprenylcysteine O-methyltransferase(Homo sapiens (Human))
National University Of Singapore
Curated by ChEMBL
LigandPNGBDBM50327701(2-(1-octyl-5-phenyl-1H-indol-3-yl)acetamide | CHEM...)
Affinity DataIC50:  1.80E+3nM. Assay description: Inhibition of recombinant ICMT expressed in Sf9 cells using [3H] AdoMet after 20 mins by scintillation counting
In DepthDetails ArticlePubMed