BDBM50328013 3-(1-Indolinyl)-5-[(2(S)-pyrrolidinyl)methoxy]pyridine trihydrochloride::CHEMBL1258683
SMILES C(Oc1cncc(c1)N1CCc2ccccc12)[C@@H]1CCCN1
InChI Key InChIKey=WUBOKQPNSKGYLH-HNNXBMFYSA-N
Data  1 IC50
  Tab Delimited (TSV)   2D SDfile   Computed 3D by Vconf -m prep SDfile
Find this compound or compounds like it in BindingDB:
Activity Spreadsheet -- Enzyme Inhibition Constant Data from BindingDB
Found 1 hit for monomerid = 50328013
TargetNeuronal acetylcholine receptor subunit alpha-4/beta-2(Homo sapiens (Human))
University Of Illinois At Chicago
Curated by ChEMBL
LigandPNGBDBM50328013(3-(1-Indolinyl)-5-[(2(S)-pyrrolidinyl)methoxy]pyri...)
Affinity DataIC50:  3.90E+3nM. Assay description: Inactivation of nAChR alpha4beta2 in human SH-EP1 cells
In DepthDetails ArticlePubMed