BDBM50328039 CHEMBL1258575::N-((2S,3R)-1-(3,5-difluorophenyl)-4-(1-(4-ethynylthiophen-2-yl)cyclohexylamino)-3-hydroxybutan-2-yl)acetamide
SMILES CC(=O)N[C@@H](Cc1cc(F)cc(F)c1)[C@H](O)CNC1(CCCCC1)c1cc(cs1)C#C
InChI Key InChIKey=MLGCDGANBFYDKA-FCHUYYIVSA-N
Data  2 IC50
  Tab Delimited (TSV)   2D SDfile   Computed 3D by Vconf -m prep SDfile
Find this compound or compounds like it in BindingDB:
Activity Spreadsheet -- Enzyme Inhibition Constant Data from BindingDB
Found 2 hits for monomerid = 50328039
TargetCathepsin D(Homo sapiens (Human))
Elan Pharmaceuticals
Curated by ChEMBL
LigandPNGBDBM50328039(CHEMBL1258575 | N-((2S,3R)-1-(3,5-difluorophenyl)-...)
Affinity DataIC50:  276nM. Assay description: Inhibition of cathepsin D
In DepthDetails ArticlePubMed
TargetBeta-secretase 1(Homo sapiens (Human))
Elan Pharmaceuticals
Curated by ChEMBL
LigandPNGBDBM50328039(CHEMBL1258575 | N-((2S,3R)-1-(3,5-difluorophenyl)-...)
Affinity DataIC50:  4.32E+3nM. Assay description: Inhibition of BACE1
In DepthDetails ArticlePubMed