BDBM50328076 6-(1H-indazol-4-yl)-N-(3-methoxyphenyl)-1-methyl-1H-pyrazolo[3,4-d]pyrimidin-4-amine::CHEMBL1257186
SMILES COc1cccc(Nc2nc(nc3n(C)ncc23)-c2cccc3[nH]ncc23)c1
InChI Key InChIKey=YKEGMKBGSDKZQJ-UHFFFAOYSA-N
Data  1 IC50
  Tab Delimited (TSV)   2D SDfile   Computed 3D by Vconf -m prep SDfile
Find this compound or compounds like it in BindingDB:
Activity Spreadsheet -- Enzyme Inhibition Constant Data from BindingDB
Found 1 hit for monomerid = 50328076
LigandPNGBDBM50328076(6-(1H-indazol-4-yl)-N-(3-methoxyphenyl)-1-methyl-1...)
Affinity DataIC50:  1.40nM. Assay description: Inhibition of PI3Kalpha
In DepthDetails ArticlePubMed