BDBM50328335 4-(2-hydroxy-3-(1-(5-phenylthieno[2,3-d]pyrimidin-4-yl)piperidin-4-ylamino)propoxy)phenol::CHEMBL1257914
SMILES OC(CNC1CCN(CC1)c1ncnc2scc(-c3ccccc3)c12)COc1ccc(O)cc1
InChI Key InChIKey=AXDLDTSPXTUODG-UHFFFAOYSA-N
Data  3 KI  1 EC50
  Tab Delimited (TSV)   2D SDfile   Computed 3D by Vconf -m prep SDfile
Find this compound or compounds like it in BindingDB:
Activity Spreadsheet -- Enzyme Inhibition Constant Data from BindingDB
Found 4 hits for monomerid = 50328335
TargetBeta-2 adrenergic receptor(Homo sapiens (Human))
4Sc
Curated by ChEMBL
LigandPNGBDBM50328335(4-(2-hydroxy-3-(1-(5-phenylthieno[2,3-d]pyrimidin-...)
Affinity DataKi:  81nM. Assay description: Displacement of [125I]-cyanopindolol from human adrenergic beta2 receptor expressed in CHO cells
In DepthDetails ArticlePubMed
TargetBeta-3 adrenergic receptor(Homo sapiens (Human))
4Sc
Curated by ChEMBL
LigandPNGBDBM50328335(4-(2-hydroxy-3-(1-(5-phenylthieno[2,3-d]pyrimidin-...)
Affinity DataKi:  148nM. Assay description: Displacement of [125I]-cyanopindolol from human adrenergic beta3 receptor expressed in CHO cells
In DepthDetails ArticlePubMed
TargetBeta-1 adrenergic receptor(Homo sapiens (Human))
4Sc
Curated by ChEMBL
LigandPNGBDBM50328335(4-(2-hydroxy-3-(1-(5-phenylthieno[2,3-d]pyrimidin-...)
Affinity DataKi:  975nM. Assay description: Agonist activity at human recombinant adrenergic beta-1 receptor expressed in CHO cells assessed as cyclic AMP formation by HTRF assay
In DepthDetails ArticlePubMed
TargetBeta-3 adrenergic receptor(Homo sapiens (Human))
4Sc
Curated by ChEMBL
LigandPNGBDBM50328335(4-(2-hydroxy-3-(1-(5-phenylthieno[2,3-d]pyrimidin-...)
Affinity DataEC50:  1.60nM. Assay description: Agonist activity at human recombinant adrenergic beta3 receptor expressed in CHO cells assessed as cyclic AMP formation by HTRF assay
In DepthDetails ArticlePubMed