BDBM50328368 CHEMBL1257442::diethyl 2-(dimethylamino)-4-phenyl-7-propylpyrrolo[1,2-b]pyridazine-5,6-dicarboxylate
SMILES CCCc1c(C(=O)OCC)c(C(=O)OCC)c2c(cc(nn12)N(C)C)-c1ccccc1
InChI Key InChIKey=GPCUMIOFOAIHFP-UHFFFAOYSA-N
Data  2 IC50
  Tab Delimited (TSV)   2D SDfile   Computed 3D by Vconf -m prep SDfile
Find this compound or compounds like it in BindingDB:
Activity Spreadsheet -- Enzyme Inhibition Constant Data from BindingDB
Found 2 hits for monomerid = 50328368
TargetSterol O-acyltransferase 1(Homo sapiens (Human))
Amgen
Curated by ChEMBL
LigandPNGBDBM50328368(CHEMBL1257442 | diethyl 2-(dimethylamino)-4-phenyl...)
Affinity DataIC50:  660nM. Assay description: Inhibition of human full-length flag-tagged ACAT1 expressed in baculovirus infected insect cells after 10 mins
In DepthDetails ArticlePubMed
TargetDiacylglycerol O-acyltransferase 1(Homo sapiens (Human))
Amgen
Curated by ChEMBL
LigandPNGBDBM50328368(CHEMBL1257442 | diethyl 2-(dimethylamino)-4-phenyl...)
Affinity DataIC50:  830nM. Assay description: Inhibition of human liver flag-tagged DGAT1 expressed in baculovirus infected insect cells after 2 hrs
In DepthDetails ArticlePubMed