BDBM50328379 CHEMBL1258944::ethyl 6-(3-cyclohexyl-1,2,4-oxadiazol-5-yl)-2-morpholino-4-phenyl-7-propylpyrrolo[1,2-b]pyridazine-5-carboxylate
SMILES CCCc1c(-c2nc(no2)C2CCCCC2)c(C(=O)OCC)c2c(cc(nn12)N1CCOCC1)-c1ccccc1
InChI Key InChIKey=KQTNPRUSWDICFO-UHFFFAOYSA-N
Data  3 IC50
  Tab Delimited (TSV)   2D SDfile   Computed 3D by Vconf -m prep SDfile
Find this compound or compounds like it in BindingDB:
Activity Spreadsheet -- Enzyme Inhibition Constant Data from BindingDB
Found 3 hits for monomerid = 50328379
TargetDiacylglycerol O-acyltransferase 1(Homo sapiens (Human))
Amgen
Curated by ChEMBL
LigandPNGBDBM50328379(CHEMBL1258944 | ethyl 6-(3-cyclohexyl-1,2,4-oxadia...)
Affinity DataIC50:  31nM. Assay description: Inhibition of DGAT1 in human Caco2 cells after 30 mins
In DepthDetails ArticlePubMed
TargetDiacylglycerol O-acyltransferase 1(Homo sapiens (Human))
Amgen
Curated by ChEMBL
LigandPNGBDBM50328379(CHEMBL1258944 | ethyl 6-(3-cyclohexyl-1,2,4-oxadia...)
Affinity DataIC50:  56nM. Assay description: Inhibition of human liver flag-tagged DGAT1 expressed in baculovirus infected insect cells after 2 hrs
In DepthDetails ArticlePubMed
TargetSterol O-acyltransferase 1(Homo sapiens (Human))
Amgen
Curated by ChEMBL
LigandPNGBDBM50328379(CHEMBL1258944 | ethyl 6-(3-cyclohexyl-1,2,4-oxadia...)
Affinity DataIC50:  690nM. Assay description: Inhibition of human full-length flag-tagged ACAT1 expressed in baculovirus infected insect cells after 10 mins
In DepthDetails ArticlePubMed