BDBM50329148 1,1,1-trifluoro-N-((1-(1-(2-fluorophenylsulfonyl)-1H-indol-2-ylsulfonyl)-4-hydroxypiperidin-4-yl)methyl)methanesulfonamide::CHEMBL1271092
SMILES OC1(CNS(=O)(=O)C(F)(F)F)CCN(CC1)S(=O)(=O)c1cc2ccccc2n1S(=O)(=O)c1ccccc1F
InChI Key InChIKey=XWEBEJFWKAUOAE-UHFFFAOYSA-N
Data  1 KI
  Tab Delimited (TSV)   2D SDfile   Computed 3D by Vconf -m prep SDfile
Find this compound or compounds like it in BindingDB:
Activity Spreadsheet -- Enzyme Inhibition Constant Data from BindingDB
Found 1 hit for monomerid = 50329148
TargetCannabinoid receptor 2(Homo sapiens (Human))
Merck Research Laboratories
Curated by ChEMBL
LigandPNGBDBM50329148(1,1,1-trifluoro-N-((1-(1-(2-fluorophenylsulfonyl)-...)
Affinity DataKi:  0.200nM. Assay description: Inhibition of beta-arrestin binding to recombinant cannabinoid CB2 receptor
In DepthDetails ArticlePubMed