BDBM50329269 (R)-2-(4-fluoro-3,5-dimethylphenylamino)-N-hydroxy-6-(4-(trifluoromethyl)benzylamino)hexanamide::CHEMBL1270211
SMILES Cc1cc(N[C@H](CCCCNCc2ccc(cc2)C(F)(F)F)C(=O)NO)cc(C)c1F
InChI Key InChIKey=BTIWHGODFARUMB-LJQANCHMSA-N
Data  1 KI
  Tab Delimited (TSV)   2D SDfile   Computed 3D by Vconf -m prep SDfile
Find this compound or compounds like it in BindingDB:
Activity Spreadsheet -- Enzyme Inhibition Constant Data from BindingDB
Found 1 hit for monomerid = 50329269
TargetLethal factor(Bacillus anthracis)
Panthera Biopharma
Curated by ChEMBL
LigandPNGBDBM50329269((R)-2-(4-fluoro-3,5-dimethylphenylamino)-N-hydroxy...)
Affinity DataKi:  0.470nM. Assay description: Inhibition of Bacillus anthracis lethal factor assessed as proteolysis using MCA-KKVYPYPME-Dap(Dnp)-NH2 peptide substrate by FRET assay
In DepthDetails ArticlePubMed