BDBM50329290 (R)-3-Isopropoxycarbonylamino-pyrrolidine-1-carboxylic acid adamantan-2-yl ester::CHEMBL1270309
SMILES CC(C)OC(=O)N[C@@H]1CCN(C1)C(=O)OC1C2CC3CC(C2)CC1C3
InChI Key InChIKey=MTMPMDZHCAGNOP-OBYDGYHJSA-N
Data  2 IC50
  Tab Delimited (TSV)   2D SDfile   Computed 3D by Vconf -m prep SDfile
Find this compound or compounds like it in BindingDB:
Activity Spreadsheet -- Enzyme Inhibition Constant Data from BindingDB
Found 2 hits for monomerid = 50329290
Target11-beta-hydroxysteroid dehydrogenase 1(Homo sapiens (Human))
Vitae Pharmaceuticals
Curated by ChEMBL
LigandPNGBDBM50329290((R)-3-Isopropoxycarbonylamino-pyrrolidine-1-carbox...)
Affinity DataIC50:  36.3nM. Assay description: Inhibition of 11betaHSD1 in human platelet assessed as [3H]-cortisone to [3H]-cortisol by microscintillation plate reader
In DepthDetails ArticlePubMed
Target11-beta-hydroxysteroid dehydrogenase 1(Homo sapiens (Human))
Vitae Pharmaceuticals
Curated by ChEMBL
LigandPNGBDBM50329290((R)-3-Isopropoxycarbonylamino-pyrrolidine-1-carbox...)
Affinity DataIC50:  6.40nM. Assay description: Inhibition of recombinant 11betaHSD1 expressed in CHO cells assessed as [3H]-cortisone to [3H]-cortisol by microscintillation plate reader
In DepthDetails ArticlePubMed