BDBM50329343 2-(3-cyanobenzamido)-3-(3-methoxypropyl)-3H-imidazo[4,5-b]pyridine-6-carboxamide::CHEMBL1270509
SMILES COCCCn1c(NC(=O)c2cccc(c2)C#N)nc2cc(cnc12)C(N)=O
InChI Key InChIKey=OPULSPRBRMLXIN-UHFFFAOYSA-N
Data  1 KI
  Tab Delimited (TSV)   2D SDfile   Computed 3D by Vconf -m prep SDfile
Find this compound or compounds like it in BindingDB:
Activity Spreadsheet -- Enzyme Inhibition Constant Data from BindingDB
Found 1 hit for monomerid = 50329343
TargetAdenosine receptor A2a(Homo sapiens (Human))
Ligand Pharmaceuticals
Curated by ChEMBL
LigandPNGBDBM50329343(2-(3-cyanobenzamido)-3-(3-methoxypropyl)-3H-imidaz...)
Affinity DataKi:  2.43E+3nM. Assay description: Displacement of [3H]SCH58261 from human recombinant A2A receptor expressed in HEK293 cells
In DepthDetails ArticlePubMed