BDBM50329351 3-cyano-N-(3-pentyl-6-(piperidine-1-carbonyl)-3H-imidazo[4,5-b]pyridin-2-yl)benzamide::CHEMBL1270917
SMILES CCCCCn1c(NC(=O)c2cccc(c2)C#N)nc2cc(cnc12)C(=O)N1CCCCC1
InChI Key InChIKey=DKWNMYDVXCDZAI-UHFFFAOYSA-N
Data  1 KI
  Tab Delimited (TSV)   2D SDfile   Computed 3D by Vconf -m prep SDfile
Find this compound or compounds like it in BindingDB:
Activity Spreadsheet -- Enzyme Inhibition Constant Data from BindingDB
Found 1 hit for monomerid = 50329351
TargetAdenosine receptor A2a(Homo sapiens (Human))
Ligand Pharmaceuticals
Curated by ChEMBL
LigandPNGBDBM50329351(3-cyano-N-(3-pentyl-6-(piperidine-1-carbonyl)-3H-i...)
Affinity DataKi:  904nM. Assay description: Displacement of [3H]SCH58261 from human recombinant A2A receptor expressed in HEK293 cells
In DepthDetails ArticlePubMed