BDBM50329357 3-cyano-N-(3-(4-fluorobenzyl)-6-(piperidine-1-carbonyl)-3H-imidazo[4,5-b]pyridin-2-yl)benzamide::CHEMBL1271223
SMILES Fc1ccc(Cn2c(NC(=O)c3cccc(c3)C#N)nc3cc(cnc23)C(=O)N2CCCCC2)cc1
InChI Key InChIKey=PSLNQTCMFLQVMF-UHFFFAOYSA-N
Data  1 KI
  Tab Delimited (TSV)   2D SDfile   Computed 3D by Vconf -m prep SDfile
Find this compound or compounds like it in BindingDB:
Activity Spreadsheet -- Enzyme Inhibition Constant Data from BindingDB
Found 1 hit for monomerid = 50329357
TargetAdenosine receptor A2a(Homo sapiens (Human))
Ligand Pharmaceuticals
Curated by ChEMBL
LigandPNGBDBM50329357(3-cyano-N-(3-(4-fluorobenzyl)-6-(piperidine-1-carb...)
Affinity DataKi:  2.59E+3nM. Assay description: Displacement of [3H]SCH58261 from human recombinant A2A receptor expressed in HEK293 cells
In DepthDetails ArticlePubMed