BDBM50329374 4'-ethyl-biphenyl-4-carboxylic acid::4'-ethylbiphenyl-4-carboxylic acid::CHEMBL443832
SMILES CCc1ccc(cc1)-c1ccc(cc1)C(O)=O
InChI Key InChIKey=SCEBDBNGUCNRCE-UHFFFAOYSA-N
Data  2 Kd
  Tab Delimited (TSV)   2D SDfile   Computed 3D by Vconf -m prep SDfile
Find this compound or compounds like it in BindingDB:
Activity Spreadsheet -- Enzyme Inhibition Constant Data from BindingDB
Found 2 hits for monomerid = 50329374
TargetApoptosis regulator Bcl-2(Homo sapiens (Human))
Abbott Laboratories
Curated by ChEMBL
LigandPNGBDBM50329374(4'-ethyl-biphenyl-4-carboxylic acid | 4'-ethylbiph...)
Affinity DataKd: >1.00E+6nM. Assay description: Binding affinity to Bcl-2 by NMR titration assay in presence of 500 uM 1,1-bis(4-chlorophenyl)-3-(dimethylamino)propan-1-ol
In DepthDetails ArticlePubMed
TargetApoptosis regulator Bcl-2(Homo sapiens (Human))
Abbott Laboratories
Curated by ChEMBL
LigandPNGBDBM50329374(4'-ethyl-biphenyl-4-carboxylic acid | 4'-ethylbiph...)
Affinity DataKd:  3.00E+5nM. Assay description: Binding affinity to Bcl-2 by NMR titration assay
In DepthDetails ArticlePubMed