BDBM50329453 5-(2-Amino-pyrimidin-4-yl)-1-methyl-2-phenyl-1H-pyrrole-3-carboxamide::CHEMBL1270923
SMILES Cn1c(cc(C(N)=O)c1-c1ccccc1)-c1ccnc(N)n1
InChI Key InChIKey=ZIORCNLDWSMFRO-UHFFFAOYSA-N
Data  1 IC50
  Tab Delimited (TSV)   2D SDfile   Computed 3D by Vconf -m prep SDfile
Find this compound or compounds like it in BindingDB:
Activity Spreadsheet -- Enzyme Inhibition Constant Data from BindingDB
Found 1 hit for monomerid = 50329453
TargetCell division cycle 7-related protein kinase(Homo sapiens (Human))
Nerviano Medical Sciences
Curated by ChEMBL
LigandPNGBDBM50329453(5-(2-Amino-pyrimidin-4-yl)-1-methyl-2-phenyl-1H-py...)
Affinity DataIC50:  140nM. Assay description: Inhibition of Cdc7
In DepthDetails ArticlePubMed