BDBM50329496 5-Isoxazoyl-Cha-Ile-(3R,6S)-6-amino-3-(4-[aminomethyl]piperidine-1-carbonyl)tetrahydro-2H-thiazolo(3,2-a)pyridin-5(3H)-one::CHEMBL1269141
SMILES CC[C@H](C)[C@H](NC(=O)[C@H](CC1CCCCC1)NC(=O)c1ccno1)C(=O)N1CC2SCC(N2C(=O)C1)C(=O)N1CCC(CN)CC1
InChI Key InChIKey=DHVZCPVEXQADNW-DDMDPKJZSA-N
Data  1 EC50
  Tab Delimited (TSV)   2D SDfile   Computed 3D by Vconf -m prep SDfile
Find this compound or compounds like it in BindingDB:
Activity Spreadsheet -- Enzyme Inhibition Constant Data from BindingDB
Found 1 hit for monomerid = 50329496
TargetProteinase-activated receptor 2(Homo sapiens (Human))
The University Of Queensland
Curated by ChEMBL
LigandPNGBDBM50329496(5-Isoxazoyl-Cha-Ile-(3R,6S)-6-amino-3-(4-[aminomet...)
Affinity DataEC50:  6.31E+3nM. Assay description: Agonist activity at PAR2 receptor in human HT-29 cells assessed as induction of intracellular calcium release
In DepthDetails ArticlePubMed