BDBM50330049 CHEMBL1271603::[(3-Bromophenyl)-(5,6,7,8-tetrahydronaphthalen-2-yl)-ketone]thiosemicarbazone
SMILES NC(=S)NN=C(c1cccc(Br)c1)c1ccc2CCCCc2c1
InChI Key InChIKey=JCRWNIDRZCBRLP-UHFFFAOYSA-N
Data  2 IC50
  Tab Delimited (TSV)   2D SDfile   Computed 3D by Vconf -m prep SDfile
Find this compound or compounds like it in BindingDB:
Activity Spreadsheet -- Enzyme Inhibition Constant Data from BindingDB
Found 2 hits for monomerid = 50330049
TargetCathepsin B(Homo sapiens (Human))
Baylor University
Curated by ChEMBL
LigandPNGBDBM50330049(CHEMBL1271603 | [(3-Bromophenyl)-(5,6,7,8-tetrahyd...)
Affinity DataIC50: >1.00E+4nM. Assay description: Inhibition of human liver cathepsin B after 5 mins by microplate reader analysis
In DepthDetails ArticlePubMed
TargetProcathepsin L(Homo sapiens (Human))
Baylor University
Curated by ChEMBL
LigandPNGBDBM50330049(CHEMBL1271603 | [(3-Bromophenyl)-(5,6,7,8-tetrahyd...)
Affinity DataIC50:  9.65E+3nM. Assay description: Inhibition of human liver cathepsin L after 5 mins by microplate reader analysis
In DepthDetails ArticlePubMed