BDBM50330490 CHEMBL1277562::N,N-dimethyl-3-(5-(1-phenylethyl)furan-2-carbonyloxy)butan-1-aminium
SMILES CC(CCN(C)C)OC(=O)c1ccc(o1)C(C)c1ccccc1
InChI Key InChIKey=UQKRKNYMJLVFPM-UHFFFAOYSA-N
Data  4 IC50
  Tab Delimited (TSV)   2D SDfile   Computed 3D by Vconf -m prep SDfile
Find this compound or compounds like it in BindingDB:
Activity Spreadsheet -- Enzyme Inhibition Constant Data from BindingDB
Found 4 hits for monomerid = 50330490
TargetLethal(3)malignant brain tumor-like protein 3(Homo sapiens (Human))
University Of North Carolina At Chapel Hill
Curated by ChEMBL
LigandPNGBDBM50330490(CHEMBL1277562 | N,N-dimethyl-3-(5-(1-phenylethyl)f...)
Affinity DataIC50:  7.50E+4nM. Assay description: Inhibition of L3MBTL3 by alpha-screening
In DepthDetails ArticlePubMed
TargetLethal(3)malignant brain tumor-like protein 4(Homo sapiens (Human))
University Of North Carolina At Chapel Hill
Curated by ChEMBL
LigandPNGBDBM50330490(CHEMBL1277562 | N,N-dimethyl-3-(5-(1-phenylethyl)f...)
Affinity DataIC50: >1.00E+5nM. Assay description: Inhibition of L3MBTL4 by alpha-screening
In DepthDetails ArticlePubMed
TargetMBT domain-containing protein 1(Homo sapiens (Human))
University Of North Carolina At Chapel Hill
Curated by ChEMBL
LigandPNGBDBM50330490(CHEMBL1277562 | N,N-dimethyl-3-(5-(1-phenylethyl)f...)
Affinity DataIC50:  6.60E+4nM. Assay description: Inhibition of MBTD1 by alpha-screening
In DepthDetails ArticlePubMed
TargetIsoform 4 of Lethal(3)malignant brain tumor-like protein 1 (4)(Homo sapiens (Human))
University Of North Carolina At Chapel Hill
Curated by ChEMBL
LigandPNGBDBM50330490(CHEMBL1277562 | N,N-dimethyl-3-(5-(1-phenylethyl)f...)
Affinity DataIC50:  8.40E+4nM. Assay description: Inhibition of L3MBTL1 by alpha-screening
In DepthDetails ArticlePubMed