BDBM50330543 3-(4-methoxyphenylsulfonyl)-6-(piperazin-1-yl)-1H-indazole::CHEMBL1277287
SMILES COc1ccc(cc1)S(=O)(=O)c1n[nH]c2cc(ccc12)N1CCNCC1
InChI Key InChIKey=OLZQQVBWGYEYMU-UHFFFAOYSA-N
Data  1 KI
  Tab Delimited (TSV)   2D SDfile   Computed 3D by Vconf -m prep SDfile
Find this compound or compounds like it in BindingDB:
Activity Spreadsheet -- Enzyme Inhibition Constant Data from BindingDB
Found 1 hit for monomerid = 50330543
Target5-hydroxytryptamine receptor 6(Homo sapiens (Human))
Wyeth Research
Curated by ChEMBL
LigandPNGBDBM50330543(3-(4-methoxyphenylsulfonyl)-6-(piperazin-1-yl)-1H-...)
Affinity DataKi:  124nM. Assay description: Displacement of [3H]LSD from human cloned 5HT6 receptor expressed in human HeLa cells
In DepthDetails ArticlePubMed