BDBM50330564 CHEMBL1277473::N-(4-Fluorobenzyl)-4-furan-2-methyl-1,4-dihydrobenzo[4,5]imidazo[1,2-a]pyrimidine-3-carboxamide
SMILES CC1=Nc2nc3ccccc3n2C(C1C(=O)Nc1ccc(F)cc1)c1ccco1
InChI Key InChIKey=VRXAOUYMQGHMEO-UHFFFAOYSA-N
Data  2 IC50
  Tab Delimited (TSV)   2D SDfile   Computed 3D by Vconf -m prep SDfile
Find this compound or compounds like it in BindingDB:
Activity Spreadsheet -- Enzyme Inhibition Constant Data from BindingDB
Found 2 hits for monomerid = 50330564
TargetAurora kinase A(Homo sapiens (Human))
China Pharmaceutical University
Curated by ChEMBL
LigandPNGBDBM50330564(CHEMBL1277473 | N-(4-Fluorobenzyl)-4-furan-2-methy...)
Affinity DataIC50:  6.15E+3nM. Assay description: Inhibition of human purified recombinant aurora-A kinase
In DepthDetails ArticlePubMed
TargetKinesin-like protein KIF11(Homo sapiens (Human))
China Pharmaceutical University
Curated by ChEMBL
LigandPNGBDBM50330564(CHEMBL1277473 | N-(4-Fluorobenzyl)-4-furan-2-methy...)
Affinity DataIC50:  5.65E+3nM. Assay description: Inhibition of human full-length Eg5 ATPase activity expressed in Escherichia coli assessed as release of inorganic phosphate after 30 mins
In DepthDetails ArticlePubMed