BDBM50330610 CHEMBL1277203::N-(4-(N-(3,5-Difluoro-4-hydroxyphenyl)sulfamoyl)phenyl)-benzamide
SMILES Oc1c(F)cc(NS(=O)(=O)c2ccc(NC(=O)c3ccccc3)cc2)cc1F
InChI Key InChIKey=PZCABSFOELENFR-UHFFFAOYSA-N
Data  2 IC50
  Tab Delimited (TSV)   2D SDfile   Computed 3D by Vconf -m prep SDfile
Find this compound or compounds like it in BindingDB:
Activity Spreadsheet -- Enzyme Inhibition Constant Data from BindingDB
Found 2 hits for monomerid = 50330610
TargetAldo-keto reductase family 1 member B1(Rattus norvegicus)
Aristotle University Of Thessaloniki
Curated by ChEMBL
LigandPNGBDBM50330610(CHEMBL1277203 | N-(4-(N-(3,5-Difluoro-4-hydroxyphe...)
Affinity DataIC50:  7.90E+3nM. Assay description: Inhibition of Fischer-344 rat lens ALR2 by least-square analysis
In DepthDetails ArticlePubMed
TargetAldo-keto reductase family 1 member A1(Rattus norvegicus)
Aristotle University Of Thessaloniki
Curated by ChEMBL
LigandPNGBDBM50330610(CHEMBL1277203 | N-(4-(N-(3,5-Difluoro-4-hydroxyphe...)
Affinity DataIC50:  6.90E+3nM. Assay description: Inhibition of Fischer-344 rat kidney AK1A1
In DepthDetails ArticlePubMed