BDBM50330870 CHEMBL1277602::trans rac-N1-(4-((6-amino-4-methylpyridin-2-yl)methyl)pyrrolidin-3-yl)-N2-(2,4-dichlorobenzyl)ethane-1,2-diamine
SMILES Cc1cc(N)nc(C[C@H]2CNC[C@@H]2NCCNCc2ccc(Cl)cc2Cl)c1
InChI Key InChIKey=JOYQAGLZWMOZGT-KXBFYZLASA-N
Data  3 KI
  Tab Delimited (TSV)   2D SDfile   Computed 3D by Vconf -m prep SDfile
Find this compound or compounds like it in BindingDB:
Activity Spreadsheet -- Enzyme Inhibition Constant Data from BindingDB
Found 3 hits for monomerid = 50330870
TargetNitric oxide synthase, inducible(Mus musculus (mouse))
Northwestern University
Curated by ChEMBL
LigandPNGBDBM50330870(CHEMBL1277602 | trans rac-N1-(4-((6-amino-4-methyl...)
Affinity DataKi:  483nM. Assay description: Inhibition of mouse recombinant iNOS
In DepthDetails ArticlePubMed
TargetNitric oxide synthase, brain(Rattus norvegicus (rat))
Northwestern University
Curated by ChEMBL
LigandPNGBDBM50330870(CHEMBL1277602 | trans rac-N1-(4-((6-amino-4-methyl...)
Affinity DataKi:  4.42E+4nM. Assay description: Inhibition of rat recombinant nNOS
In DepthDetails ArticlePubMed
TargetNitric oxide synthase, endothelial(Bos taurus (bovine))
Northwestern University
Curated by ChEMBL
LigandPNGBDBM50330870(CHEMBL1277602 | trans rac-N1-(4-((6-amino-4-methyl...)
Affinity DataKi:  7.61E+4nM. Assay description: Inhibition of bovine recombinant eNOS
In DepthDetails ArticlePubMed