BDBM50330897 6-(((3R,4S)-4-(2-(4-fluorobenzylamino)ethoxy)pyrrolidin-3-yl)methyl)pyridin-2-amine trihydrochloride::CHEMBL1233765::CHEMBL1278133
SMILES Cc1cc(N)nc(C[C@H]2CNC[C@@H]2OCCNCCc2cccc(F)c2)c1
InChI Key InChIKey=NESZTSPBRDBHCW-PXNSSMCTSA-N
Data  4 KI
PDB links: 1 PDB ID matches this monomer.
  Tab Delimited (TSV)   2D SDfile   Computed 3D by Vconf -m prep SDfile
Find this compound or compounds like it in BindingDB:
Activity Spreadsheet -- Enzyme Inhibition Constant Data from BindingDB
Found 4 hits for monomerid = 50330897
TargetNitric oxide synthase, inducible(Mus musculus (mouse))
Northwestern University
Curated by ChEMBL
LigandPNGBDBM50330897(6-(((3R,4S)-4-(2-(4-fluorobenzylamino)ethoxy)pyrro...)
Affinity DataKi:  63nM. Assay description: Inhibition of mouse recombinant iNOS
In DepthDetails ArticlePubMed
TargetNitric oxide synthase, inducible(Mus musculus (mouse))
Northwestern University
Curated by ChEMBL
LigandPNGBDBM50330897(6-(((3R,4S)-4-(2-(4-fluorobenzylamino)ethoxy)pyrro...)
Affinity DataKi:  6.30E+4nM. Assay description: Inhibition of mouse recombinant iNOS
In DepthDetails ArticlePubMed
TargetNitric oxide synthase, brain(Rattus norvegicus (rat))
Northwestern University
Curated by ChEMBL
LigandPNGBDBM50330897(6-(((3R,4S)-4-(2-(4-fluorobenzylamino)ethoxy)pyrro...)
Affinity DataKi:  1.87E+7nM. Assay description: Inhibition of rat recombinant nNOS
In DepthDetails ArticlePubMed
TargetNitric oxide synthase, endothelial(Bos taurus (bovine))
Northwestern University
Curated by ChEMBL
LigandPNGBDBM50330897(6-(((3R,4S)-4-(2-(4-fluorobenzylamino)ethoxy)pyrro...)
Affinity DataKi:  3.62E+7nM. Assay description: Inhibition of bovine recombinant eNOS