BDBM50330985 2-(3,4-Dihydroxyphenyl)-5,7-dimethoxy-4H-chromen-4-one::CHEMBL1278226
SMILES COc1cc(OC)c2c(c1)oc(cc2=O)-c1ccc(O)c(O)c1
InChI Key InChIKey=NKGJZNRUAGQIRY-UHFFFAOYSA-N
Data  1 EC50
  Tab Delimited (TSV)   2D SDfile   Computed 3D by Vconf -m prep SDfile
Find this compound or compounds like it in BindingDB:
Activity Spreadsheet -- Enzyme Inhibition Constant Data from BindingDB
Found 1 hit for monomerid = 50330985
TargetSodium-dependent dopamine transporter(Rattus norvegicus (rat))
Zhengzhou University
Curated by ChEMBL
LigandPNGBDBM50330985(2-(3,4-Dihydroxyphenyl)-5,7-dimethoxy-4H-chromen-4...)
Affinity DataEC50:  3.42E+3nM. Assay description: Agonist activity at rat DAT expressed in CHO cells
In DepthDetails ArticlePubMed