BDBM50331066 6-chloro-5,7-dimethyl-2-(trifluoromethyl)-2H-chromene-3-carboxylic acid::CHEMBL1288771
SMILES Cc1cc2OC(C(=Cc2c(C)c1Cl)C(O)=O)C(F)(F)F
InChI Key InChIKey=UNEVTVWOSGJGLU-UHFFFAOYSA-N
Data  5 IC50
  Tab Delimited (TSV)   2D SDfile   Computed 3D by Vconf -m prep SDfile
Find this compound or compounds like it in BindingDB:
Activity Spreadsheet -- Enzyme Inhibition Constant Data from BindingDB
Found 5 hits for monomerid = 50331066
TargetProstaglandin G/H synthase 1(Homo sapiens (Human))
Pfizer
Curated by ChEMBL
LigandPNGBDBM50331066(6-chloro-5,7-dimethyl-2-(trifluoromethyl)-2H-chrom...)
Affinity DataIC50:  2.98E+4nM. Assay description: Inhibition of human COX-1
In DepthDetails ArticlePubMed
TargetProstaglandin G/H synthase 1(Homo sapiens (Human))
Pfizer
Curated by ChEMBL
LigandPNGBDBM50331066(6-chloro-5,7-dimethyl-2-(trifluoromethyl)-2H-chrom...)
Affinity DataIC50: >1.00E+5nM. Assay description: Inhibition of human recombinant COX1 pre-incubated for 15 mins before fluorometric substrate addition by fluorescence based assay
In DepthDetails ArticlePubMed
TargetProstaglandin G/H synthase 2(Homo sapiens (Human))
Pfizer
Curated by ChEMBL
LigandPNGBDBM50331066(6-chloro-5,7-dimethyl-2-(trifluoromethyl)-2H-chrom...)
Affinity DataIC50:  130nM. Assay description: Inhibition of human COX-2
In DepthDetails ArticlePubMed
TargetProstaglandin G/H synthase 2(Homo sapiens (Human))
Pfizer
Curated by ChEMBL
LigandPNGBDBM50331066(6-chloro-5,7-dimethyl-2-(trifluoromethyl)-2H-chrom...)
Affinity DataIC50:  69nM. Assay description: Inhibition of human recombinant COX2 pre-incubated for 15 mins before fluorometric substrate addition by fluorescence based assay
In DepthDetails ArticlePubMed
TargetProstaglandin G/H synthase 2(Homo sapiens (Human))
Pfizer
Curated by ChEMBL
LigandPNGBDBM50331066(6-chloro-5,7-dimethyl-2-(trifluoromethyl)-2H-chrom...)
Affinity DataIC50:  54nM. Assay description: Inhibition of human recombinant COX2 pre-incubated for 15 mins before fluorometric substrate addition by fluorescence based assay
In DepthDetails ArticlePubMed