BDBM50331219 (2S,3R,4S,5S,6R)-2-(4-chloro-3-((2-(furan-3-yl)pyrimidin-5-yl)methyl)phenyl)-6-ethyltetrahydro-2H-pyran-3,4,5-triol::CHEMBL1289280
SMILES CC[C@H]1O[C@H]([C@H](O)[C@@H](O)[C@@H]1O)c1ccc(Cl)c(Cc2cnc(nc2)-c2ccoc2)c1
InChI Key InChIKey=UFDKYHZYVLFOIC-ADAARDCZSA-N
Data  1 IC50
  Tab Delimited (TSV)   2D SDfile   Computed 3D by Vconf -m prep SDfile
Find this compound or compounds like it in BindingDB:
Activity Spreadsheet -- Enzyme Inhibition Constant Data from BindingDB
Found 1 hit for monomerid = 50331219
TargetSodium/glucose cotransporter 2(Homo sapiens (Human))
Green Cross
Curated by ChEMBL
LigandPNGBDBM50331219((2S,3R,4S,5S,6R)-2-(4-chloro-3-((2-(furan-3-yl)pyr...)
Affinity DataIC50:  246nM. Assay description: Inhibition of human SGLT2 assessed as inhibition of methyl-alpha-D-glucopyranoside uptake by cell based assay
In DepthDetails ArticlePubMed