BDBM50331579 4-(6-(1H-indazol-5-ylamino)-2-morpholinopyrimidin-4-yl)phenol::CHEMBL1290070
SMILES Oc1ccc(cc1)-c1cc(Nc2ccc3[nH]ncc3c2)nc(n1)N1CCOCC1
InChI Key InChIKey=HMSGOUUGYSKOHH-UHFFFAOYSA-N
Data  1 IC50
  Tab Delimited (TSV)   2D SDfile   Computed 3D by Vconf -m prep SDfile
Find this compound or compounds like it in BindingDB:
Activity Spreadsheet -- Enzyme Inhibition Constant Data from BindingDB
Found 1 hit for monomerid = 50331579
TargetPhosphatidylinositol 4,5-bisphosphate 3-kinase catalytic subunit alpha isoform(Homo sapiens (Human))
Novartis Institutes For Biomedical Research
Curated by ChEMBL
LigandPNGBDBM50331579(4-(6-(1H-indazol-5-ylamino)-2-morpholinopyrimidin-...)
Affinity DataIC50:  6.50E+3nM. Assay description: Inhibition of PI3Kalpha
In DepthDetails ArticlePubMed