BDBM50331856 CHEMBL251766::Karempferitrin::kaempferitrin::kaempferol-3,7-O-(alpha)-dirhamnoside::kaempferol-3,7-O-alpha-L-dirhamnoside
SMILES C[C@@H]1O[C@@H](Oc2cc(O)c3c(c2)oc(-c2ccc(O)cc2)c(O[C@@H]2O[C@@H](C)[C@H](O)[C@@H](O)[C@H]2O)c3=O)[C@H](O)[C@H](O)[C@H]1O
InChI Key InChIKey=PUPKKEQDLNREIM-QNSQPKOQSA-N
Data  1 IC50
  Tab Delimited (TSV)   2D SDfile   Computed 3D by Vconf -m prep SDfile
Find this compound or compounds like it in BindingDB:
Activity Spreadsheet -- Enzyme Inhibition Constant Data from BindingDB
Found 1 hit for monomerid = 50331856
TargetPolyphenol oxidase 2(Agaricus bisporus (Common mushroom))
Amorepacific
Curated by ChEMBL
LigandPNGBDBM50331856(CHEMBL251766 | Karempferitrin | kaempferitrin | ka...)
Affinity DataIC50: >4.00E+5nM. Assay description: Inhibition of mushroom tyrosinase after 20 mins by spectrophotometric analysis
In DepthDetails ArticlePubMed