BDBM50331873 5,6-dichloro-2-(trifluoromethyl)-2H-chromene-3-carboxylic acid::CHEMBL1288533
SMILES OC(=O)C1=Cc2c(OC1C(F)(F)F)ccc(Cl)c2Cl
InChI Key InChIKey=YBOWAHQKNFIXBD-UHFFFAOYSA-N
Data  4 IC50
  Tab Delimited (TSV)   2D SDfile   Computed 3D by Vconf -m prep SDfile
Find this compound or compounds like it in BindingDB:
Activity Spreadsheet -- Enzyme Inhibition Constant Data from BindingDB
Found 4 hits for monomerid = 50331873
TargetProstaglandin G/H synthase 1(Homo sapiens (Human))
Pfizer
Curated by ChEMBL
LigandPNGBDBM50331873(5,6-dichloro-2-(trifluoromethyl)-2H-chromene-3-car...)
Affinity DataIC50:  1.51E+3nM. Assay description: Inhibition of human COX-1
In DepthDetails ArticlePubMed
TargetProstaglandin G/H synthase 2(Homo sapiens (Human))
Pfizer
Curated by ChEMBL
LigandPNGBDBM50331873(5,6-dichloro-2-(trifluoromethyl)-2H-chromene-3-car...)
Affinity DataIC50:  3nM. Assay description: Inhibition of human COX-2
In DepthDetails ArticlePubMed
TargetProstaglandin G/H synthase 2(Homo sapiens (Human))
Pfizer
Curated by ChEMBL
LigandPNGBDBM50331873(5,6-dichloro-2-(trifluoromethyl)-2H-chromene-3-car...)
Affinity DataIC50:  10nM. Assay description: Inhibition of human COX2
In DepthDetails ArticlePubMed
TargetProstaglandin G/H synthase 1(Homo sapiens (Human))
Pfizer
Curated by ChEMBL
LigandPNGBDBM50331873(5,6-dichloro-2-(trifluoromethyl)-2H-chromene-3-car...)
Affinity DataIC50:  690nM. Assay description: Inhibition of human COX1
In DepthDetails ArticlePubMed