BDBM50332189 14H-diindolo[2,3-a:3',2'-h]quinolizine::CHEMBL1287982::NSC-677939
SMILES c1ccc2c(c1)nc1c2ccn2ccc3c4ccccc4[nH]c3c12
InChI Key InChIKey=MNJDUMFRXPRNJB-UHFFFAOYSA-N
Data  1 IC50
  Tab Delimited (TSV)   2D SDfile   Computed 3D by Vconf -m prep SDfile
Find this compound or compounds like it in BindingDB:
Activity Spreadsheet -- Enzyme Inhibition Constant Data from BindingDB
Found 1 hit for monomerid = 50332189
TargetRibosyldihydronicotinamide dehydrogenase [quinone](Homo sapiens (Human))
University Of Manchester And Manchester Cancer Research Center
Curated by ChEMBL
LigandPNGBDBM50332189(14H-diindolo[2,3-a:3',2'-h]quinolizine | CHEMBL128...)
Affinity DataIC50:  2.90E+3nM. Assay description: Inhibition of human recombinant NQO2
In DepthDetails ArticlePubMed