BDBM50332289 (R)-5-((4-((4-ethylpiperazin-1-yl)(hydroxyimino)methyl)phenyl)ethynyl)-5-((6-methoxy-1-oxoisoindolin-2-yl)methyl)imidazolidine-2,4-dione::CHEMBL1287939
SMILES CCN1CCN(CC1)C(=NO)c1ccc(cc1)C#C[C@]1(CN2Cc3ccc(OC)cc3C2=O)NC(=O)NC1=O
InChI Key InChIKey=FUKIDORAYBVNQH-MUUNZHRXSA-N
Data  1 KI
  Tab Delimited (TSV)   2D SDfile   Computed 3D by Vconf -m prep SDfile
Find this compound or compounds like it in BindingDB:
Activity Spreadsheet -- Enzyme Inhibition Constant Data from BindingDB
Found 1 hit for monomerid = 50332289
TargetDisintegrin and metalloproteinase domain-containing protein 17(Homo sapiens (Human))
Merck Research Laboratories
Curated by ChEMBL
LigandPNGBDBM50332289((R)-5-((4-((4-ethylpiperazin-1-yl)(hydroxyimino)me...)
Affinity DataKi:  0.160nM. Assay description: Inhibition of TACE
In DepthDetails ArticlePubMed