BDBM50332462 2-(2-methyl-4-((4-methyl-2-(4-(trifluoromethyl)phenyl)thiazol-5-yl)methylselanyl)phenoxy)acetic acid::2-methyl-4-((4-methyl-2-(4-trifluoromethylphenyl)-1,3-selenazol-5-yl)-methylsulfanyl)phenoxy-acetic acid::CHEMBL1169827
SMILES Cc1nc(sc1C[Se]c1ccc(OCC(O)=O)c(C)c1)-c1ccc(cc1)C(F)(F)F
InChI Key InChIKey=SGRNBEGQBHHKMY-UHFFFAOYSA-N
Data  4 EC50
  Tab Delimited (TSV)   2D SDfile   Computed 3D by Vconf -m prep SDfile
Find this compound or compounds like it in BindingDB:
Activity Spreadsheet -- Enzyme Inhibition Constant Data from BindingDB
Found 4 hits for monomerid = 50332462
TargetPeroxisome proliferator-activated receptor alpha(Homo sapiens (Human))
Seoul National University
Curated by ChEMBL
LigandPNGBDBM50332462(2-(2-methyl-4-((4-methyl-2-(4-(trifluoromethyl)phe...)
Affinity DataEC50: >1.00E+3nM. Assay description: Agonist activity at human PPAR-alpha expressed in african green monkey CV-1 cells after 24 hrs by luciferase reporter gene assay
In DepthDetails ArticlePubMed
TargetPeroxisome proliferator-activated receptor delta(Mus musculus)
Seoul National University
Curated by ChEMBL
LigandPNGBDBM50332462(2-(2-methyl-4-((4-methyl-2-(4-(trifluoromethyl)phe...)
Affinity DataEC50:  2.30nM. Assay description: Agonist activity at mouse PPAR-delta expressed in african green monkey CV-1 cells after 24 hrs by luciferase reporter gene assay
In DepthDetails ArticlePubMed
TargetPeroxisome proliferator-activated receptor gamma(Homo sapiens (Human))
Seoul National University
Curated by ChEMBL
LigandPNGBDBM50332462(2-(2-methyl-4-((4-methyl-2-(4-(trifluoromethyl)phe...)
Affinity DataEC50: >1.00E+3nM. Assay description: Agonist activity at human PPAR-gamma expressed in african green monkey CV-1 cells after 24 hrs by luciferase reporter gene assay
In DepthDetails ArticlePubMed
TargetPeroxisome proliferator-activated receptor delta(Homo sapiens (Human))
Seoul National University
Curated by ChEMBL
LigandPNGBDBM50332462(2-(2-methyl-4-((4-methyl-2-(4-(trifluoromethyl)phe...)
Affinity DataEC50:  0.900nM. Assay description: Agonist activity at human PPAR-delta expressed in african green monkey CV-1 cells after 24 hrs by luciferase reporter gene assay
In DepthDetails ArticlePubMed